Reaction Details
TargetDelta-type opioid receptor
LigandBDBM50077083
Substrate/Competitorn/a
Meas. Tech.ChEBML_217735
IC50 1.4±n/a nM
Citation Barn, DRBom, ACottney, JCaulfield, WLMorphy, JR Synthesis of novel analogues of the delta opioid ligand SNC-80 using AlCl3-promoted aminolysis. Bioorg Med Chem Lett9:1329-34 (1999) Delta-type opioid receptor
Name:Delta-type opioid receptor
Type:G Protein-Coupled Receptor (GPCR)
Mol. Mass.:40382.98
Organism:Homo sapiens (Human)
Description:Competition binding assays were carried out using membrane preparations from transfected HN9.10 cells that constitutively expressed the delta opioid receptor.
Residue:372
BDBM50077083
NameBDBM50077083
Synonyms:4-[(4-Benzo[1,3]dioxol-5-ylmethyl-piperazin-1-yl)-phenyl-methyl]-N,N-diethyl-benzamide | CHEMBL27161
TypeSmall organic molecule
Emp. Form.C30H35N3O3
Mol. Mass.485.6172
SMILESCCN(CC)C(=O)c1ccc(cc1)C(N1CCN(Cc2ccc3OCOc3c2)CC1)c1ccccc1