Reaction Details
TargetDelta-type opioid receptor
LigandBDBM50039029
Substrate/Competitorn/a
Meas. Tech.ChEBML_217735
IC50 2±n/a nM
Citation Barn, DRBom, ACottney, JCaulfield, WLMorphy, JR Synthesis of novel analogues of the delta opioid ligand SNC-80 using AlCl3-promoted aminolysis. Bioorg Med Chem Lett9:1329-34 (1999) Delta-type opioid receptor
Name:Delta-type opioid receptor
Type:G Protein-Coupled Receptor (GPCR)
Mol. Mass.:40382.98
Organism:Homo sapiens (Human)
Description:Competition binding assays were carried out using membrane preparations from transfected HN9.10 cells that constitutively expressed the delta opioid receptor.
Residue:372
BDBM50039029
NameBDBM50039029
Synonyms:(+)-4-((alpha R)-((2S,5R)-4-allyl-2,5-dimethylpiperazin-1-yl)(3-methoxyphenyl)methyl)-N,N-diethylbenzamide 3-[(4-Allyl-2,5-dimethyl-piperazin-1-yl)-(4-diethylcarbamoyl-phenyl)-methyl]-benzoic acid 4-((R)-((2S,5R)-4-allyl-2,5-dimethylpiperazin-1-yl)(3-methoxyphenyl)methyl)-N,N-diethylbenzamide 4-[(4-Allyl-2,5-dimethyl-piperazin-1-yl)-(3-methoxy-phenyl)-methyl]-N,N-diethyl-benzamide (SNC 80) 4-[(R)-((2R,5S)-4-Allyl-2,5-dimethyl-piperazin-1-yl)-(3-methoxy-phenyl)-methyl]-N,N-diethyl-benzamide 4-[(R)-((R)-4-(S)-Allyl-2,5-dimethyl-piperazin-1-yl)-(3-methoxy-phenyl)-methyl]-N,N-diethyl-benzamide 4-[(R)-[(2S,5R)-4-allyl-2,5-dimethylpiperazin-1-yl](3-methoxyphenyl)-methyl]-N,N-diethylbenzamide SNC-80
TypeSmall organic molecule
Emp. Form.C28H39N3O2
Mol. Mass.449.6282
SMILESCCN(CC)C(=O)c1ccc(cc1)[C@@H](N1C[C@@H](C)N(CC=C)C[C@@H]1C)c1cccc(OC)c1