Reaction Details
TargetMu-type opioid receptor
LigandBDBM50077083
Substrate/Competitorn/a
Meas. Tech.ChEBML_221915
IC50>10000±n/a nM
Citation Barn, DRBom, ACottney, JCaulfield, WLMorphy, JR Synthesis of novel analogues of the delta opioid ligand SNC-80 using AlCl3-promoted aminolysis. Bioorg Med Chem Lett9:1329-34 (1999) Mu-type opioid receptor
Name:Mu-type opioid receptor
Type:G Protein-Coupled Receptor (GPCR)
Mol. Mass.:44503.11
Organism:Rattus norvegicus (rat)
Description:Competition binding assays were carried out using membrane preparations from transfected HN9.10 cells that constitutively expressed the mu opioid receptor.
Residue:398
BDBM50077083
NameBDBM50077083
Synonyms:4-[(4-Benzo[1,3]dioxol-5-ylmethyl-piperazin-1-yl)-phenyl-methyl]-N,N-diethyl-benzamide | CHEMBL27161
TypeSmall organic molecule
Emp. Form.C30H35N3O3
Mol. Mass.485.6172
SMILESCCN(CC)C(=O)c1ccc(cc1)C(N1CCN(Cc2ccc3OCOc3c2)CC1)c1ccccc1