Reaction Details
TargetD(2) dopamine receptor
LigandBDBM50077601
Substrate/Competitorn/a
Meas. Tech.ChEMBL_62888 (CHEMBL675973)
Ki 0.630000±n/a nM
Citation Mewshaw, REWebb, MBMarquis, KLMcGaughey, GBShi, XWasik, TScerni, RBrennan, JAAndree, TH New generation dopaminergic agents. 6. Structure-activity relationship studies of a series of 4-(aminoethoxy)indole and 4-(aminoethoxy)indolone derivatives based on the newly discovered 3-hydroxyphenoxyethylamine D2 template. J Med Chem42:2007-20 (1999) 
 
D(2) dopamine receptor
Name:D(2) dopamine receptor
Type:G Protein-Coupled Receptor (GPCR)
Mol. Mass.:50931.60
Organism:Rattus norvegicus (rat)
Description:P61169
Residue:444
BDBM50077601
NameBDBM50077601
Synonyms:7-Fluoro-4-[2-(naphthalen-2-ylamino)-ethoxy]-1,3-dihydro-indol-2-one | CHEMBL62290
TypeSmall organic molecule
Emp. Form.C20H17FN2O2
Mol. Mass.336.3596
SMILESFc1ccc(OCCNc2ccc3ccccc3c2)c2CC(=O)Nc12