Reaction Details
TargetD(2) dopamine receptor
LigandBDBM50077604
Substrate/Competitorn/a
Meas. Tech.ChEMBL_58598 (CHEMBL667111)
Ki 4.1±n/a nM
Citation Mewshaw, REWebb, MBMarquis, KLMcGaughey, GBShi, XWasik, TScerni, RBrennan, JAAndree, TH New generation dopaminergic agents. 6. Structure-activity relationship studies of a series of 4-(aminoethoxy)indole and 4-(aminoethoxy)indolone derivatives based on the newly discovered 3-hydroxyphenoxyethylamine D2 template. J Med Chem42:2007-20 (1999) 
 
D(2) dopamine receptor
Name:D(2) dopamine receptor
Type:G Protein-Coupled Receptor (GPCR)
Mol. Mass.:50931.60
Organism:Rattus norvegicus (rat)
Description:P61169
Residue:444
BDBM50077604
NameBDBM50077604
Synonyms:7-Chloro-4-[2-(4-chloro-benzylamino)-ethoxy]-1,3-dihydro-indol-2-one | CHEMBL302000
TypeSmall organic molecule
Emp. Form.C17H16Cl2N2O2
Mol. Mass.351.227
SMILESClc1ccc(CNCCOc2ccc(Cl)c3NC(=O)Cc23)cc1