Reaction Details
TargetD(2) dopamine receptor
LigandBDBM50061642
Substrate/Competitorn/a
Meas. Tech.ChEMBL_62888 (CHEMBL675973)
Ki 0.400000±n/a nM
Citation Mewshaw, REWebb, MBMarquis, KLMcGaughey, GBShi, XWasik, TScerni, RBrennan, JAAndree, TH New generation dopaminergic agents. 6. Structure-activity relationship studies of a series of 4-(aminoethoxy)indole and 4-(aminoethoxy)indolone derivatives based on the newly discovered 3-hydroxyphenoxyethylamine D2 template. J Med Chem42:2007-20 (1999) 
 
D(2) dopamine receptor
Name:D(2) dopamine receptor
Type:G Protein-Coupled Receptor (GPCR)
Mol. Mass.:50931.60
Organism:Rattus norvegicus (rat)
Description:P61169
Residue:444
BDBM50061642
NameBDBM50061642
Synonyms:(S)-3-(Benzylamino-methyl)-2,3-dihydro-benzo[1,4]dioxin-6-ol; oxalic acid CHEMBL423890
TypeSmall organic molecule
Emp. Form.C16H17NO3
Mol. Mass.271.3111
SMILESOc1ccc2OC[C@H](CNCc3ccccc3)Oc2c1