Reaction Details
TargetPepsin A
LigandBDBM50077622
Substrate/Competitorn/a
Meas. Tech.ChEMBL_154143 (CHEMBL759813)
IC50 920±n/a nM
Citation Kratzel, MSchlichtner, BKirchmayer, RBernkop-Schnürch, A Simplified pepstatins: synthesis and evaluation of N-terminally modified analogues. J Med Chem42:2041-5 (1999) 
 
Pepsin A
Name:Pepsin A
Type:Enzyme
Mol. Mass.:41232.87
Organism:Porcine
Description:n/a
Residue:385
BDBM50077622
NameBDBM50077622
Synonyms:(S)-N-[(S)-1-((S)-2-Hydroxy-1-isobutyl-octylcarbamoyl)-2-methyl-propyl]-3-methyl-2-(3-methyl-butyrylamino)-butyramide | CHEMBL63888
TypeSmall organic molecule
Emp. Form.C27H53N3O4
Mol. Mass.483.7274
SMILESCCCCCCC(O)[C@H](CC(C)C)NC(=O)[C@@H](NC(=O)[C@@H](NC(=O)CC(C)C)C(C)C)C(C)C