Reaction Details
TargetD(1A) dopamine receptor
LigandBDBM50077664
Substrate/Competitorn/a
Meas. Tech.ChEBML_58669
Ki 6668±n/a nM
Citation Ahn, KHLee, SJLee, CHHong, CYPark, TK N-substituted-3-arylpyrrolidines: potent and selective ligands at serotonin 1A receptor. Bioorg Med Chem Lett9:1379-84 (1999) D(1A) dopamine receptor
Name:D(1A) dopamine receptor
Type:Enzyme Catalytic Domain
Mol. Mass.:49429.75
Organism:RAT
Description:P18901
Residue:446
BDBM50077664
NameBDBM50077664
Synonyms:2-{4-[3-(4-Fluoro-phenyl)-pyrrolidin-1-yl]-butyl}-1,1-dioxo-1,2-dihydro-1lambda*6*-benzo[d]isothiazol-3-one | CHEMBL417661
TypeSmall organic molecule
Emp. Form.C21H23FN2O3S
Mol. Mass.402.482
SMILESFc1ccc(cc1)C1CCN(CCCCN2C(=O)c3ccccc3S2(=O)=O)C1