Reaction Details
Target5-hydroxytryptamine receptor 1D
LigandBDBM50065419
Substrate/Competitorn/a
Meas. Tech.ChEMBL_1683 (CHEMBL617043)
EC50 0.600000±n/a nM
Citation van Niel, MBCollins, IBeer, MSBroughton, HBCheng, SKGoodacre, SCHeald, ALocker, KLMacLeod, AMMorrison, DMoyes, CRO'Connor, DPike, ARowley, MRussell, MGSohal, BStanton, JAThomas, SVerrier, HWatt, APCastro, JL Fluorination of 3-(3-(piperidin-1-yl)propyl)indoles and 3-(3-(piperazin-1-yl)propyl)indoles gives selective human 5-HT1D receptor ligands with improved pharmacokinetic profiles. J Med Chem42:2087-104 (1999) 
 
5-hydroxytryptamine receptor 1D
Name:5-hydroxytryptamine receptor 1D
Type:G Protein-Coupled Receptor (GPCR)
Mol. Mass.:41920.63
Organism:Homo sapiens (Human)
Description:Receptor binding assays were performed using human clone stably expressed in CHO cells.
Residue:377
BDBM50065419
NameBDBM50065419
Synonyms:3-[3-(4-Benzyl-piperidin-1-yl)-propyl]-5-[1,2,4]triazol-4-yl-1H-indole | CHEMBL294547
TypeSmall organic molecule
Emp. Form.C25H29N5
Mol. Mass.399.5313
SMILESC(CN1CCC(Cc2ccccc2)CC1)Cc1c[nH]c2ccc(cc12)-n1cnnc1