Reaction Details
TargetGag-Pol polyprotein [489-587]
LigandBDBM50078088
Substrate/Competitorn/a
Meas. Tech.ChEMBL_157707 (CHEMBL763381)
pH6.2±n/a
Ki 0.090000±n/a nM
Commentsextracted
Citation Vara Prasad, JVBoyer, FEDomagala, JMEllsworth, ELGajda, CHagen, SEMarkoski, LJTait, BDLunney, EATummino, PJFerguson, DHoller, THupe, DNouhan, CGracheck, SJVanderRoest, SSaunders, JIyer, KSinz, MBrodfuehrer, J Nonpeptidic HIV protease inhibitors: 6-alkyl-5,6-dihydropyran-2-ones possessing achiral 3-(4-amino/carboxamide-2-t-butyl,5-methylphenyl thio) moiety: antiviral activities and pharmacokinetic properties. Bioorg Med Chem Lett9:1481-6 (1999) Gag-Pol polyprotein [489-587]
Name:Gag-Pol polyprotein [489-587]
Type:Enzyme Subunit
Mol. Mass.:10781.16
Organism:Human immunodeficiency virus type 1
Description:P04585[489-587]
Residue:99
BDBM50078088
NameBDBM50078088
Synonyms:(S)-3-(2-tert-Butyl-4-hydroxymethyl-5-methyl-phenylsulfanyl)-4-hydroxy-6-[2-(4-hydroxy-phenyl)-ethyl]-6-isopropyl-5,6-dihydro-pyran-2-one | CHEMBL37037
TypeSmall organic molecule
Emp. Form.C28H36O5S
Mol. Mass.484.647
SMILESCC(C)[C@]1(CCc2ccc(O)cc2)CC(=O)C(Sc2cc(C)c(CO)cc2C(C)(C)C)C(=O)O1