Reaction Details
TargetMetabotropic glutamate receptor 2
LigandBDBM50078226
Substrate/Competitorn/a
Meas. Tech.ChEMBL_106214 (CHEMBL713202)
Ki 1500±n/a nM
Citation Wichmann, JAdam, GKolczewski, SMutel, VWoltering, T Structure-activity relationships of substituted 5H-thiazolo[3,2-a]pyrimidines as group 2 metabotropic glutamate receptor antagonists. Bioorg Med Chem Lett9:1573-6 (1999) Metabotropic glutamate receptor 2
Name:Metabotropic glutamate receptor 2
Type:PROTEIN
Mol. Mass.:95786.41
Organism:Rattus norvegicus
Description:ChEMBL_105034
Residue:872
BDBM50078226
NameBDBM50078226
Synonyms:2-(2,6-Dichloro-phenyl)-5-(2-methoxy-phenyl)-7-methyl-5H-thiazolo[3,2-a]pyrimidine-6-carboxylic acid 2-dimethylamino-ethyl ester | CHEMBL38729
TypeSmall organic molecule
Emp. Form.C25H25Cl2N3O3S
Mol. Mass.518.455
SMILESCOc1ccccc1C1N2C=C(SC2=NC(C)=C1C(=O)OCCN(C)C)c1c(Cl)cccc1Cl