Reaction Details
TargetMetabotropic glutamate receptor 2
LigandBDBM50078225
Substrate/Competitorn/a
Meas. Tech.ChEMBL_106214 (CHEMBL713202)
Ki 8000±n/a nM
Citation Wichmann, JAdam, GKolczewski, SMutel, VWoltering, T Structure-activity relationships of substituted 5H-thiazolo[3,2-a]pyrimidines as group 2 metabotropic glutamate receptor antagonists. Bioorg Med Chem Lett9:1573-6 (1999) Metabotropic glutamate receptor 2
Name:Metabotropic glutamate receptor 2
Type:PROTEIN
Mol. Mass.:95786.41
Organism:Rattus norvegicus
Description:ChEMBL_105034
Residue:872
BDBM50078225
NameBDBM50078225
Synonyms:2-(2,6-Dichloro-phenyl)-7-methyl-5-o-tolyl-5H-thiazolo[3,2-a]pyrimidine-6-carboxylic acid 2-dimethylamino-ethyl ester | CHEMBL288472
TypeSmall organic molecule
Emp. Form.C25H25Cl2N3O2S
Mol. Mass.502.456
SMILESCN(C)CCOC(=O)C1=C(C)N=C2SC(=CN2C1c1ccccc1C)c1c(Cl)cccc1Cl