Reaction Details
Target3-oxo-5-alpha-steroid 4-dehydrogenase 1
LigandBDBM50043604
Substrate/Competitorn/a
Meas. Tech.ChEBML_204757
IC50 1100±n/a nM
Citation Baston, EHartmann, RW N-substituted 4-(5-indolyl)benzoic acids. Synthesis and evaluation of steroid 5alpha-reductase type I and II inhibitory activity. Bioorg Med Chem Lett9:1601-6 (1999) 3-oxo-5-alpha-steroid 4-dehydrogenase 1
Name:3-oxo-5-alpha-steroid 4-dehydrogenase 1
Type:Enzyme
Mol. Mass.:29472.80
Organism:Homo sapiens (Human)
Description:P18405
Residue:259
BDBM50043604
NameBDBM50043604
Synonyms:(8S,9S,10R,13S,14S,17S)-17-(tert-butylcarbamoyl)-10,13-dimethyl-2,7,8,9,10,11,12,13,14,15,16,17-dodecahydro-1H-cyclopenta[a]phenanthrene-3-carboxylic acid CHEMBL138225 | Epristeride
TypeSmall organic molecule
Emp. Form.C25H37NO3
Mol. Mass.399.5662
SMILESCC(C)(C)NC(=O)[C@H]1CC[C@H]2[C@@H]3CC=C4C=C(CC[C@]4(C)[C@H]3CC[C@]12C)C(O)=O