Reaction Details
TargetScytalone dehydratase
LigandBDBM50078269
Substrate/Competitorn/a
Meas. Tech.ChEBML_199522
Ki 0.240000±n/a nM
Citation Jordan, DBLessen, TAWawrzak, ZBisaha, JJGehret, TCHansen, SLSchwartz, RSBasarab, GS Design of scytalone dehydratase inhibitors as rice blast fungicides: (N-phenoxypropyl)-carboxamides. Bioorg Med Chem Lett9:1607-12 (1999) Scytalone dehydratase
Name:Scytalone dehydratase
Type:PROTEIN
Mol. Mass.:20248.63
Organism:Magnaporthe grisea
Description:ChEMBL_199536
Residue:172
BDBM50078269
NameBDBM50078269
Synonyms:(R)-2-Cyano-N-[(R)-2-(3-fluoro-phenoxy)-1-methyl-ethyl]-3,3-dimethyl-butyramide | CHEMBL43852
TypeSmall organic molecule
Emp. Form.C16H21FN2O2
Mol. Mass.292.3485
SMILESC[C@H](COc1cccc(F)c1)NC(=O)[C@@H](C#N)C(C)(C)C