Reaction Details
TargetScytalone dehydratase
LigandBDBM50078296
Substrate/Competitorn/a
Meas. Tech.ChEBML_199522
Ki 33±n/a nM
Citation Jordan, DBLessen, TAWawrzak, ZBisaha, JJGehret, TCHansen, SLSchwartz, RSBasarab, GS Design of scytalone dehydratase inhibitors as rice blast fungicides: (N-phenoxypropyl)-carboxamides. Bioorg Med Chem Lett9:1607-12 (1999) Scytalone dehydratase
Name:Scytalone dehydratase
Type:PROTEIN
Mol. Mass.:20248.63
Organism:Magnaporthe grisea
Description:ChEMBL_199536
Residue:172
BDBM50078296
NameBDBM50078296
Synonyms:(R)-2,2-Dichloro-1-ethyl-3-methyl-cyclopropanecarboxylic acid [(S)-2-(2,5-difluoro-phenoxy)-1-methyl-ethyl]-amide | CHEMBL41610
TypeSmall organic molecule
Emp. Form.C16H19Cl2F2NO2
Mol. Mass.366.23
SMILESCC[C@@]1(C(C)C1(Cl)Cl)C(=O)N[C@@H](C)COc1cc(F)ccc1F