Reaction Details
TargetScytalone dehydratase
LigandBDBM50078295
Substrate/Competitorn/a
Meas. Tech.ChEBML_199522
Ki 7.2±n/a nM
Citation Jordan, DBLessen, TAWawrzak, ZBisaha, JJGehret, TCHansen, SLSchwartz, RSBasarab, GS Design of scytalone dehydratase inhibitors as rice blast fungicides: (N-phenoxypropyl)-carboxamides. Bioorg Med Chem Lett9:1607-12 (1999) Scytalone dehydratase
Name:Scytalone dehydratase
Type:PROTEIN
Mol. Mass.:20248.63
Organism:Magnaporthe grisea
Description:ChEMBL_199536
Residue:172
BDBM50078295
NameBDBM50078295
Synonyms:2-Cyano-3,3-dimethyl-N-(1-methyl-3-phenyl-propyl)-butyramide | CHEMBL416427
TypeSmall organic molecule
Emp. Form.C17H24N2O
Mol. Mass.272.3853
SMILESCC(CCc1ccccc1)NC(=O)C(C#N)C(C)(C)C