Reaction Details
TargetXaa-Pro aminopeptidase 2
LigandBDBM50078390
Substrate/Competitorn/a
Meas. Tech.ChEMBL_35515 (CHEMBL644748)
IC50 58000±n/a nM
Citation Maggiora, LLOrawski, ATSimmons, WH Apstatin analogue inhibitors of aminopeptidase P, a bradykinin-degrading enzyme. J Med Chem42:2394-402 (1999) 
 
Xaa-Pro aminopeptidase 2
Name:Xaa-Pro aminopeptidase 2
Type:Enzyme
Mol. Mass.:75618.88
Organism:Homo sapiens (Human)
Description:O43895
Residue:674
BDBM50078390
NameBDBM50078390
Synonyms:(S)-1-((2S,3S)-3-Amino-2-hydroxy-5-methyl-hexanoyl)-pyrrolidine-2-carboxylic acid ((S)-1-carbamoyl-ethyl)-amide | CHEMBL309274
TypeSmall organic molecule
Emp. Form.C15H28N4O4
Mol. Mass.328.4072
SMILESCC(C)C[C@H](N)[C@H](O)C(=O)N1CCC[C@H]1C(=O)N[C@@H](C)C(N)=O