Reaction Details
TargetXaa-Pro aminopeptidase 2
LigandBDBM50078398
Substrate/Competitorn/a
Meas. Tech.ChEMBL_35520 (CHEMBL644753)
IC50 2600±n/a nM
Citation Maggiora, LLOrawski, ATSimmons, WH Apstatin analogue inhibitors of aminopeptidase P, a bradykinin-degrading enzyme. J Med Chem42:2394-402 (1999) 
 
Xaa-Pro aminopeptidase 2
Name:Xaa-Pro aminopeptidase 2
Type:Enzyme
Mol. Mass.:75618.88
Organism:Homo sapiens (Human)
Description:O43895
Residue:674
BDBM50078398
NameBDBM50078398
Synonyms:2-[(S)-2-((S)-1-Carbamoyl-ethylcarbamoyl)-pyrrolidin-1-yl]-4-phenyl-butyric acid | CHEMBL311925
TypeSmall organic molecule
Emp. Form.C18H25N3O4
Mol. Mass.347.4088
SMILESC[C@H](NC(=O)[C@@H]1CCCN1C(CCc1ccccc1)C(O)=O)C(N)=O