Reaction Details
TargetXaa-Pro aminopeptidase 2
LigandBDBM50078395
Substrate/Competitorn/a
Meas. Tech.ChEMBL_35520 (CHEMBL644753)
IC50 48000±n/a nM
Citation Maggiora, LLOrawski, ATSimmons, WH Apstatin analogue inhibitors of aminopeptidase P, a bradykinin-degrading enzyme. J Med Chem42:2394-402 (1999) 
 
Xaa-Pro aminopeptidase 2
Name:Xaa-Pro aminopeptidase 2
Type:Enzyme
Mol. Mass.:75618.88
Organism:Homo sapiens (Human)
Description:O43895
Residue:674
BDBM50078395
NameBDBM50078395
Synonyms:(S)-1-(2-Hydroxycarbamoyl-cyclohexanecarbonyl)-pyrrolidine-2-carboxylic acid ((S)-1-carbamoyl-ethyl)-amide | CHEMBL80368
TypeSmall organic molecule
Emp. Form.C16H26N4O5
Mol. Mass.354.4014
SMILESC[C@H](NC(=O)[C@@H]1CCCN1C(=O)C1CCCCC1C(=O)NO)C(N)=O