Reaction Details
TargetIntegrin alpha-IIb/beta-3
LigandBDBM50078436
Substrate/Competitorn/a
Meas. Tech.ChEMBL_70310 (CHEMBL677857)
Kd 1.2±n/a nM
Citation Egbertson, MSCook, JJBednar, BPrugh, JDBednar, RAGaul, SLGould, RJHartman, GDHomnick, CFHolahan, MALibby, LALynch, JJLynch, RJSitko, GRStranieri, MTVassallo, LM Non-peptide GPIIb/IIIa inhibitors. 20. Centrally constrained thienothiophene alpha-sulfonamides are potent, long acting in vivo inhibitors of platelet aggregation. J Med Chem42:2409-21 (1999) 
 
Integrin alpha-IIb/beta-3
Name:Integrin alpha-IIb/beta-3
Synonyms:Glycoprotein IIb/IIIa
Type:n/a
Mol. Mass.:n/a
Description:ASSAY_ID of EBI is 30109
Components:This complex has 2 components.
Component 1
Name:Integrin beta-3
Type:Protein
Mol. Mass.:87038.91
Organism:Homo sapiens (Human)
Description:P05106
Residue:788
Component 2
Name:Integrin alpha-IIb
Synonyms:CD_antigen=CD41 GPIIb Glycoprotein IIb ITGA2B Integrin alpha-IIb heavy chain Integrin alpha-IIb light chain, form 2 Integrin alpha-V/beta-3 and alpha-IIb/beta 3 | Platelet membrane glycoprotein IIb
Type:Protein
Mol. Mass.:113354.85
Organism:Homo sapiens (Human)
Description:P08514
Residue:1039
BDBM50078436
NameBDBM50078436
Synonyms:(S)-2-(2-Ethoxy-ethanesulfonylamino)-3-{[5-(2-piperidin-4-yl-ethyl)-thieno[2,3-b]thiophene-2-carbonyl]-amino}-propionic acid | CHEMBL79211
TypeSmall organic molecule
Emp. Form.C21H31N3O6S3
Mol. Mass.517.682
SMILESCCOCCS(=O)(=O)N[C@@H](CNC(=O)c1cc2cc(CCC3CCNCC3)sc2s1)C(O)=O