Reaction Details
TargetD(4) dopamine receptor
LigandBDBM50523471
Substrate/Competitorn/a
Meas. Tech.ChEMBL_1890424 (CHEMBL4392178)
EC50 3.4±n/a nM
Citation Keck, TMFree, RBDay, MMBrown, SLMaddaluna, MSFountain, GCooper, CFallon, BHolmes, MStang, CTBurkhardt, RBonifazi, AEllenberger, MPNewman, AHSibley, DRWu, CBoateng, CA Dopamine D J Med Chem62:3722-3740 (2019) 
 
D(4) dopamine receptor
Name:D(4) dopamine receptor
Type:Enzyme
Mol. Mass.:48373.19
Organism:Homo sapiens (Human)
Description:P21917
Residue:419
BDBM50523471
NameBDBM50523471
Synonyms:CHEMBL4443054
TypeSmall organic molecule
Emp. Form.C17H21N5O
Mol. Mass.311.3815
SMILESCc1cccc(NC(=O)CN2CCN(CC2)c2ncccn2)c1