Reaction Details
TargetCo-chaperonin GroES
LigandBDBM50409816
Substrate/Competitorn/a
Meas. Tech.ChEMBL_1891108 (CHEMBL4392935)
IC50 9500±n/a nM
Citation Stevens, MAbdeen, SSalim, NRay, AMWashburn, AChitre, SSivinski, JPark, YHoang, QQChapman, EJohnson, SM HSP60/10 chaperonin systems are inhibited by a variety of approved drugs, natural products, and known bioactive molecules. Bioorg Med Chem Lett29:1106-1112 (2019) 
 
Co-chaperonin GroES
Name:Co-chaperonin GroES
Type:PROTEIN
Mol. Mass.:10384.31
Organism:Escherichia coli
Description:ChEMBL_117709
Residue:97
BDBM50409816
NameBDBM50409816
Synonyms:ABAMECTIN
TypeSmall organic molecule
Emp. Form.C48H74O14
Mol. Mass.875.0928
SMILESCC[C@H](C)[C@H]1O[C@]2(CC[C@@H]1C)C[C@@H]1C[C@@H](C\C=C(C)\[C@@H](O[C@H]3C[C@H](OC)[C@@H](O[C@H]4C[C@H](OC)[C@@H](O)[C@H](C)O4)[C@H](C)O3)[C@@H](C)\C=C\C=C3/CO[C@@H]4[C@H](O)C(C)=C[C@@H](C(=O)O1)[C@]34O)O2