Reaction Details
TargetThiosulfate sulfurtransferase
LigandBDBM50030475
Substrate/Competitorn/a
Meas. Tech.ChEMBL_1891102 (CHEMBL4392929)
IC50>100000±n/a nM
Citation Stevens, MAbdeen, SSalim, NRay, AMWashburn, AChitre, SSivinski, JPark, YHoang, QQChapman, EJohnson, SM HSP60/10 chaperonin systems are inhibited by a variety of approved drugs, natural products, and known bioactive molecules. Bioorg Med Chem Lett29:1106-1112 (2019) 
 
Thiosulfate sulfurtransferase
Name:Thiosulfate sulfurtransferase
Type:PROTEIN
Mol. Mass.:33432.06
Organism:Homo sapiens
Description:ChEMBL_118080
Residue:297
BDBM50030475
NameBDBM50030475
Synonyms:7-Dehydrocholesterol Cholecalciferol Dihydrocholesterol Vitamin D 3
TypeSmall organic molecule
Emp. Form.C27H44O
Mol. Mass.384.6377
SMILES[H][C@@]1(CC[C@@]2([H])\C(CCC[C@]12C)=C\C=C1\C[C@@H](O)CCC1=C)[C@H](C)CCCC(C)C