Reaction Details
TargetIntegrin alpha-V/beta-3
LigandBDBM50059133
Substrate/Competitorn/a
Meas. Tech.ChEBML_214643
Ki 2±n/a nM
Citation Keenan, RMMiller, WHBarton, LSBondinell, WECousins, RDEppley, DFHwang, SMKwon, CLago, MANguyen, TTSmith, BRUzinskas, INYuan, CC Orally bioavailable nonpeptide vitronectin receptor antagonists containing 2-aminopyridine arginine mimetics. Bioorg Med Chem Lett9:1801-6 (1999) Integrin alpha-V/beta-3
Name:Integrin alpha-V/beta-3
Type:Enzyme
Mol. Mass.:n/a
Description:n/a
Components:This complex has 2 components.
Component 1
Name:Integrin alpha-V
Synonyms:ITAV_HUMAN Integrin alpha-V/alpha-5 VNRA Vitronectin receptor | Vitronectin receptor subunit alpha
Type:PROTEIN
Mol. Mass.:116024.92
Organism:Homo sapiens (Human)
Description:ChEMBL_582336
Residue:1048
Component 2
Name:Integrin beta-3
Synonyms:CD_antigen=CD61 GPIIIa ITGB3 Platelet membrane glycoprotein IIIa
Type:Protein
Mol. Mass.:87038.91
Organism:Homo sapiens (Human)
Description:P05106
Residue:788
BDBM50059133
NameBDBM50059133
Synonyms:CHEMBL50106 {(S)-7-[(1H-Benzoimidazol-2-ylmethyl)-methyl-carbamoyl]-4-methyl-3-oxo-2,3,4,5-tetrahydro-1H-benzo[e][1,4]diazepin-2-yl}-acetic acid | {7-[(1H-Benzoimidazol-2-ylmethyl)-methyl-carbamoyl]-4-methyl-3-oxo-2,3,4,5-tetrahydro-1H-benzo[e][1,4]diazepin-2-yl}-acetic acid
TypeSmall organic molecule
Emp. Form.C22H23N5O4
Mol. Mass.421.4491
SMILESCN(Cc1nc2ccccc2[nH]1)C(=O)c1ccc2N[C@@H](CC(O)=O)C(=O)N(C)Cc2c1