Reaction Details
Target72 kDa type IV collagenase
LigandBDBM50523895
Substrate/Competitorn/a
Meas. Tech.ChEMBL_1891358 (CHEMBL4393185)
IC50 0.048000±n/a nM
Citation Lenci, EInnocenti, RDi Francescantonio, TMenchi, GBianchini, FContini, ATrabocchi, A Identification of highly potent and selective MMP2 inhibitors addressing the S1' subsite with d-proline-based compounds. Bioorg Med Chem27:1891-1902 (2019) 
 
72 kDa type IV collagenase
Name:72 kDa type IV collagenase
Type:Enzyme
Mol. Mass.:73870.36
Organism:Homo sapiens (Human)
Description: P08253
Residue:660
BDBM50523895
NameBDBM50523895
Synonyms:CHEMBL4522121
TypeSmall organic molecule
Emp. Form.C28H29N3O7S
Mol. Mass.551.611
SMILESONC(=O)[C@H]1CCCC1S(=O)(=O)c1ccc(NC(=O)c2ccc(CNC(=O)OCc3ccccc3)cc2)cc1