Reaction Details
TargetVesicular acetylcholine transporter
LigandBDBM50079278
Substrate/Competitorn/a
Meas. Tech.ChEMBL_213559 (CHEMBL817829)
Ki 0.400000±n/a nM
Citation Efange, SMKhare, ABMach, RHParsons, SM Hydroxylated decahydroquinolines as ligands for the vesicular acetylcholine transporter: synthesis and biological evaluation. J Med Chem42:2862-9 (1999) 
 
Vesicular acetylcholine transporter
Name:Vesicular acetylcholine transporter
Type:PROTEIN
Mol. Mass.:56900.67
Organism:Homo sapiens (Human)
Description:ChEMBL_1507628
Residue:532
BDBM50079278
NameBDBM50079278
Synonyms:(4aR,6R,7R,8aR)-1-((E)-3-Iodo-allyl)-7-(4-phenyl-piperidin-1-yl)-decahydro-quinolin-6-ol trans-trans-1-(3-iodoallyl)-7-(4-phenylpiperidin-1-yl)-decahydroquinolin-6-ol
TypeSmall organic molecule
Emp. Form.C23H33IN2O
Mol. Mass.480.4254
SMILESO[C@@H]1C[C@H]2CCCN(C\C=C\I)[C@@H]2C[C@H]1N1CCC(CC1)c1ccccc1