Reaction Details
TargetVesicular acetylcholine transporter
LigandBDBM50018094
Substrate/Competitorn/a
Meas. Tech.ChEMBL_213559 (CHEMBL817829)
Ki 2±n/a nM
Citation Efange, SMKhare, ABMach, RHParsons, SM Hydroxylated decahydroquinolines as ligands for the vesicular acetylcholine transporter: synthesis and biological evaluation. J Med Chem42:2862-9 (1999) 
 
Vesicular acetylcholine transporter
Name:Vesicular acetylcholine transporter
Type:PROTEIN
Mol. Mass.:56900.67
Organism:Homo sapiens (Human)
Description:ChEMBL_1507628
Residue:532
BDBM50018094
NameBDBM50018094
Synonyms:(1R,2R)-2-(4-Phenyl-piperidin-1-yl)-cyclohexanol 2-(4-Phenyl-piperidin-1-yl)-cyclohexanol(Vesamicol) Vesamicol | trans-2-(4-phenylpiperidin-1-yl)cyclohexanol
TypeSmall organic molecule
Emp. Form.C17H25NO
Mol. Mass.259.3865
SMILESO[C@@H]1CCCC[C@H]1N1CCC(CC1)c1ccccc1