Reaction Details
TargetPlasminogen
LigandBDBM50079383
Substrate/Competitorn/a
Meas. Tech.ChEMBL_155388 (CHEMBL760747)
Ki 520000±n/a nM
Citation Sanders, TCSeto, CT 4-Heterocyclohexanone-based inhibitors of the serine protease plasmin. J Med Chem42:2969-76 (1999) 
 
Plasminogen
Name:Plasminogen
Type:Enzyme
Mol. Mass.:90579.18
Organism:Homo sapiens (Human)
Description:n/a
Residue:810
BDBM50079383
NameBDBM50079383
Synonyms:(R)-2-Amino-3-methyl-pentanoic acid {(S)-1-[(6-amino-hexyl)-cyclohexyl-carbamoyl]-2-phenyl-ethyl}-amide | CHEMBL101236
TypeSmall organic molecule
Emp. Form.C27H46N4O2
Mol. Mass.458.6797
SMILESCCC(C)[C@@H](N)C(=O)N[C@@H](Cc1ccccc1)C(=O)N(CCCCCCN)C1CCCCC1