Reaction Details
TargetKappa-type opioid receptor
LigandBDBM50079415
Substrate/Competitorn/a
Meas. Tech.ChEMBL_145966 (CHEMBL752817)
Ki 20±n/a nM
Citation Wan, QMurray, TFAldrich, JV A novel acetylated analogue of dynorphin A-(1-11) amide as a kappa-opioid receptor antagonist. J Med Chem42:3011-3 (1999) 
 
Kappa-type opioid receptor
Name:Kappa-type opioid receptor
Type:G Protein-Coupled Receptor (GPCR)
Mol. Mass.:42648.76
Organism:Homo sapiens (Human)
Description:P41145
Residue:380
BDBM50079415
NameBDBM50079415
Synonyms:Ac-Tyr-Lys-Trp-Trp-Leu-Arg-Arg-D-Ala-Arg-Pro-Lys-NH2 | CHEMBL412248
TypeSmall organic molecule
Emp. Form.C77H117N25O13
Mol. Mass.1600.9126
SMILESCC(C)C[C@H](NC(=O)[C@H](Cc1c[nH]c2ccccc12)NC(=O)[C@H](Cc1c[nH]c2ccccc12)NC(=O)[C@H](CCCCN)NC(=O)[C@H](Cc1ccc(O)cc1)NC(C)=O)C(=O)N[C@@H](CCCNC(N)=N)C(=O)N[C@@H](CCCNC(N)=N)C(=O)N[C@H](C)C(=O)N[C@@H](CCCNC(N)=N)C(=O)N1CCC[C@H]1C(=O)N[C@@H](CCCCN)C(N)=O