Reaction Details
TargetKappa-type opioid receptor
LigandBDBM50079414
Substrate/Competitorn/a
Meas. Tech.ChEMBL_145966 (CHEMBL752817)
Ki 1367±n/a nM
Citation Wan, QMurray, TFAldrich, JV A novel acetylated analogue of dynorphin A-(1-11) amide as a kappa-opioid receptor antagonist. J Med Chem42:3011-3 (1999) 
 
Kappa-type opioid receptor
Name:Kappa-type opioid receptor
Type:G Protein-Coupled Receptor (GPCR)
Mol. Mass.:42648.76
Organism:Homo sapiens (Human)
Description:P41145
Residue:380
BDBM50079414
NameBDBM50079414
Synonyms:Ac-Tyr-Lys-Trp-Trp-NH2 | CHEMBL102690
TypeSmall organic molecule
Emp. Form.C39H46N8O6
Mol. Mass.722.8325
SMILESCC(=O)N[C@@H](Cc1ccc(O)cc1)C(=O)N[C@@H](CCCCN)C(=O)N[C@@H](Cc1c[nH]c2ccccc12)C(=O)N[C@@H](Cc1c[nH]c2ccccc12)C(N)=O