Reaction Details
TargetEndothelin receptor type B
LigandBDBM50079418
Substrate/Competitorn/a
Meas. Tech.ChEMBL_63846 (CHEMBL673230)
Ki 130±n/a nM
Citation Amberg, WHergenröder, SHillen, HJansen, RKettschau, GKling, AKlinge, DRaschack, MRiechers, HUnger, L Discovery and synthesis of (S)-3-[2-(3,4-dimethoxyphenyl)ethoxy]-2- (4,6-dimethylpyrimidin-2-yloxy)-3,3-diphenylpropionic acid (LU 302872), a novel orally active mixed ET(A)/ET(B) receptor antagonist. J Med Chem42:3026-32 (1999) 
 
Endothelin receptor type B
Name:Endothelin receptor type B
Type:Enzyme Catalytic Domain
Mol. Mass.:49664.00
Organism:Homo sapiens (Human)
Description:ENDOTHELIN B EDNRB HUMAN::P24530
Residue:442
BDBM50079418
NameBDBM50079418
Synonyms:3,3-Bis-(4-chloro-phenyl)-3-[2-(3,4-dimethoxy-phenyl)-ethoxy]-2-(4-methoxy-6-methyl-pyrimidin-2-yloxy)-propionic acid | CHEMBL276288
TypeSmall organic molecule
Emp. Form.C31H30Cl2N2O7
Mol. Mass.613.485
SMILESCOc1cc(C)nc(OC(C(O)=O)C(OCCc2ccc(OC)c(OC)c2)(c2ccc(Cl)cc2)c2ccc(Cl)cc2)n1