Reaction Details
TargetEndothelin-1 receptor
LigandBDBM50079420
Substrate/Competitorn/a
Meas. Tech.ChEMBL_65646 (CHEMBL678558)
Ki 105±n/a nM
Citation Amberg, WHergenröder, SHillen, HJansen, RKettschau, GKling, AKlinge, DRaschack, MRiechers, HUnger, L Discovery and synthesis of (S)-3-[2-(3,4-dimethoxyphenyl)ethoxy]-2- (4,6-dimethylpyrimidin-2-yloxy)-3,3-diphenylpropionic acid (LU 302872), a novel orally active mixed ET(A)/ET(B) receptor antagonist. J Med Chem42:3026-32 (1999) 
 
Endothelin-1 receptor
Name:Endothelin-1 receptor
Type:Enzyme Catalytic Domain
Mol. Mass.:48736.88
Organism:Homo sapiens (Human)
Description:P25101
Residue:427
BDBM50079420
NameBDBM50079420
Synonyms:2-(4-Methoxy-5,7-dihydro-furo[3,4-d]pyrimidin-2-yloxy)-3-[2-(4-methoxy-phenyl)-ethoxy]-3,3-di-p-tolyl-propionic acid | CHEMBL318146
TypeSmall organic molecule
Emp. Form.C33H34N2O7
Mol. Mass.570.6323
SMILESCOc1ccc(CCOC(C(Oc2nc3COCc3c(OC)n2)C(O)=O)(c2ccc(C)cc2)c2ccc(C)cc2)cc1