Reaction Details
TargetEndothelin-1 receptor
LigandBDBM50079417
Substrate/Competitorn/a
Meas. Tech.ChEMBL_65646 (CHEMBL678558)
Ki 3.49±n/a nM
Citation Amberg, WHergenröder, SHillen, HJansen, RKettschau, GKling, AKlinge, DRaschack, MRiechers, HUnger, L Discovery and synthesis of (S)-3-[2-(3,4-dimethoxyphenyl)ethoxy]-2- (4,6-dimethylpyrimidin-2-yloxy)-3,3-diphenylpropionic acid (LU 302872), a novel orally active mixed ET(A)/ET(B) receptor antagonist. J Med Chem42:3026-32 (1999) 
 
Endothelin-1 receptor
Name:Endothelin-1 receptor
Type:Enzyme Catalytic Domain
Mol. Mass.:48736.88
Organism:Homo sapiens (Human)
Description:P25101
Residue:427
BDBM50079417
NameBDBM50079417
Synonyms:3-[2-(3,4-Dimethoxy-phenyl)-ethoxy]-2-(4,6-dimethyl-pyrimidin-2-yloxy)-3,3-diphenyl-propionic acid Feloprentan
TypeSmall organic molecule
Emp. Form.C31H32N2O6
Mol. Mass.528.5956
SMILESCOc1ccc(CCOC(C(Oc2nc(C)cc(C)n2)C(O)=O)(c2ccccc2)c2ccccc2)cc1OC