Reaction Details
TargetEndothelin receptor type B
LigandBDBM50079432
Substrate/Competitorn/a
Meas. Tech.ChEMBL_63846 (CHEMBL673230)
Ki 115±n/a nM
Citation Amberg, WHergenröder, SHillen, HJansen, RKettschau, GKling, AKlinge, DRaschack, MRiechers, HUnger, L Discovery and synthesis of (S)-3-[2-(3,4-dimethoxyphenyl)ethoxy]-2- (4,6-dimethylpyrimidin-2-yloxy)-3,3-diphenylpropionic acid (LU 302872), a novel orally active mixed ET(A)/ET(B) receptor antagonist. J Med Chem42:3026-32 (1999) 
 
Endothelin receptor type B
Name:Endothelin receptor type B
Type:Enzyme Catalytic Domain
Mol. Mass.:49664.00
Organism:Homo sapiens (Human)
Description:ENDOTHELIN B EDNRB HUMAN::P24530
Residue:442
BDBM50079432
NameBDBM50079432
Synonyms:4-{2-[2-Carboxy-2-(4,6-dimethyl-pyrimidin-2-yloxy)-1,1-diphenyl-ethoxy]-ethyl}-benzoic acid | CHEMBL101742
TypeSmall organic molecule
Emp. Form.C30H28N2O6
Mol. Mass.512.5531
SMILESCc1cc(C)nc(OC(C(O)=O)C(OCCc2ccc(cc2)C(O)=O)(c2ccccc2)c2ccccc2)n1