Reaction Details
TargetAdenosine receptor A1
LigandBDBM50079447
Substrate/Competitorn/a
Meas. Tech.ChEMBL_29465 (CHEMBL642194)
Ki 32000±n/a nM
Citation Jiang, JLi, AHJang, SYChang, LMelman, NMoro, SJi, XLobkovsky, EBClardy, JCJacobson, KA Chiral resolution and stereospecificity of 6-phenyl-4-phenylethynyl- 1,4-dihydropyridines as selective A(3) adenosine receptor antagonists. J Med Chem42:3055-65 (1999) 
 
Adenosine receptor A1
Name:Adenosine receptor A1
Type:Protein
Mol. Mass.:36704.13
Organism:Rattus norvegicus (rat)
Description:n/a
Residue:326
BDBM50079447
NameBDBM50079447
Synonyms:(S)-2-Methyl-6-phenyl-4-phenylethynyl-1,4-dihydro-pyridine-3,5-dicarboxylic acid 5-benzyl ester 3-ethyl ester | CHEMBL321579
TypeSmall organic molecule
Emp. Form.C31H27NO4
Mol. Mass.477.5504
SMILESCCOC(=O)C1[C@H](C#Cc2ccccc2)C(C(=O)OCc2ccccc2)=C(N=C1C)c1ccccc1