Reaction Details
TargetAdenosine receptor A3
LigandBDBM50035800
Substrate/Competitorn/a
Meas. Tech.ChEMBL_31991 (CHEMBL646439)
Ki 23500±n/a nM
Citation Jiang, JLi, AHJang, SYChang, LMelman, NMoro, SJi, XLobkovsky, EBClardy, JCJacobson, KA Chiral resolution and stereospecificity of 6-phenyl-4-phenylethynyl- 1,4-dihydropyridines as selective A(3) adenosine receptor antagonists. J Med Chem42:3055-65 (1999) 
 
Adenosine receptor A3
Name:Adenosine receptor A3
Type:G Protein-Coupled Receptor (GPCR)
Mol. Mass.:36197.32
Organism:Homo sapiens (Human)
Description:P0DMS8
Residue:318
BDBM50035800
NameBDBM50035800
Synonyms:(S)-2,6-Dimethyl-5-nitro-4-(2-trifluoromethyl-phenyl)-1,4-dihydro-pyridine-3-carboxylic acid methyl ester CHEMBL283013
TypeSmall organic molecule
Emp. Form.C16H15F3N2O4
Mol. Mass.356.2965
SMILESCOC(=[OH+])C1=C(C)[N-]C(C)=C(C1c1ccccc1C(F)(F)F)[N+]([O-])=O