Reaction Details
TargetVoltage-dependent L-type calcium channel subunit alpha-1C
LigandBDBM50079459
Substrate/Competitorn/a
Meas. Tech.ChEMBL_42762 (CHEMBL653732)
Ki 18±n/a nM
Citation Natale, NRRogers, MEStaples, RTriggle, DJRutledge, A Lipophilic 4-isoxazolyl-1,4-dihydropyridines: synthesis and structure-activity relationships. J Med Chem42:3087-93 (1999) 
 
Voltage-dependent L-type calcium channel subunit alpha-1C
Name:Voltage-dependent L-type calcium channel subunit alpha-1C
Type:Enzyme Catalytic Domain
Mol. Mass.:248979.79
Organism:Homo sapiens (Human)
Description:Calcium channel (Type L) 0 HUMAN::Q13936
Residue:2221
BDBM50079459
NameBDBM50079459
Synonyms:4-[5-(2-Biphenyl-4-yl-ethyl)-3-methyl-isoxazol-4-yl]-2,6-dimethyl-1,4-dihydro-pyridine-3,5-dicarboxylic acid diethyl ester | CHEMBL104082
TypeSmall organic molecule
Emp. Form.C31H34N2O5
Mol. Mass.514.6121
SMILESCCOC(=O)C1C(c2c(C)noc2CCc2ccc(cc2)-c2ccccc2)C(C(=O)OCC)=C(C)N=C1C