Reaction Details
TargetProthrombin
LigandBDBM50079482
Substrate/Competitorn/a
Meas. Tech.ChEMBL_208546 (CHEMBL814315)
Ki 0.00035±n/a nM
Citation Steinmetzer, TZhu, BYKonishi, Y Potent bivalent thrombin inhibitors: replacement of the scissile peptide bond at P(1)-P(1)' with arginyl ketomethylene isosteres. J Med Chem42:3109-15 (1999) 
 
Prothrombin
Name:Prothrombin
Type:Protein
Mol. Mass.:70029.57
Organism:Homo sapiens (Human)
Description:P00734
Residue:622
BDBM50079482
NameBDBM50079482
Synonyms:Arginyl Ketomethylene analogue | CHEMBL410589
TypeSmall organic molecule
Emp. Form.C92H140N22O30S
Mol. Mass.2066.29
SMILESCC[C@@H](C)[C@H](NC(=O)[C@@H]1CCCN1C(=O)[C@H](CCC(O)=O)NC(=O)[C@H](Cc1ccc(O)cc1)NC(=O)[C@H](CC(O)=O)NC(=O)CNC(=O)CNC(=O)CNC(=O)CNC(=O)CSCC(=O)[C@H](CCCNC(N)=N)NC(=O)[C@@H]1CCCN1C(=O)[C@H](N)CC1CCCCC1)C(=O)N1CCC[C@H]1C(=O)N[C@@H](CCC(O)=O)C(=O)N[C@@H](CCC(O)=O)C(=O)N[C@@H](C)C(=O)N[C@@H](CC1CCCCC1)C(=O)N[C@H](CCC(N)=O)C(O)=O