Reaction Details
TargetProthrombin
LigandBDBM50079483
Substrate/Competitorn/a
Meas. Tech.ChEMBL_208546 (CHEMBL814315)
Ki 1460±n/a nM
Citation Steinmetzer, TZhu, BYKonishi, Y Potent bivalent thrombin inhibitors: replacement of the scissile peptide bond at P(1)-P(1)' with arginyl ketomethylene isosteres. J Med Chem42:3109-15 (1999) 
 
Prothrombin
Name:Prothrombin
Type:Protein
Mol. Mass.:70029.57
Organism:Homo sapiens (Human)
Description:P00734
Residue:622
BDBM50079483
NameBDBM50079483
Synonyms:Arginyl Ketomethylene analogue | CHEMBL409563
TypeSmall organic molecule
Emp. Form.C66H92N12O25
Mol. Mass.1453.5021
SMILESCC[C@@H](C)[C@H](NC(=O)[C@H](CCC(O)=O)NC(=O)[C@H](CCC(O)=O)NC(=O)[C@H](Cc1ccccc1)NC(=O)[C@H](CC(O)=O)NC(C)=O)C(=O)N1CCC[C@H]1C(=O)N[C@@H](CCC(O)=O)C(=O)N[C@@H](CCC(O)=O)C(=O)N[C@@H](Cc1ccc(O)cc1)C(=O)N[C@@H](CC(C)C)C(=O)N[C@@H](CCC(N)=O)C(O)=O