Reaction Details
TargetEstrogen receptor
LigandBDBM50054811
Substrate/Competitorn/a
Meas. Tech.ChEMBL_67508 (CHEMBL682292)
IC50 500±n/a nM
Citation Kraft, KSRuenitz, PCBartlett, MG Carboxylic acid analogues of tamoxifen: (Z)-2-[p-(1, 2-diphenyl-1-butenyl)phenoxy]-N,N-dimethylethylamine. Estrogen receptor affinity and estrogen antagonist effects in MCF-7 cells. J Med Chem42:3126-33 (1999) 
 
Estrogen receptor
Name:Estrogen receptor
Type:Protein
Mol. Mass.:66230.44
Organism:Homo sapiens (Human)
Description:P03372
Residue:595
BDBM50054811
NameBDBM50054811
Synonyms:CHEMBL106773 | {4-[(Z)-1-(4-Hydroxy-phenyl)-2-phenyl-but-1-enyl]-phenoxy}-acetic acid
TypeSmall organic molecule
Emp. Form.C24H22O4
Mol. Mass.374.4291
SMILESCC\C(=C(/c1ccc(O)cc1)c1ccc(OCC(O)=O)cc1)c1ccccc1