Reaction Details
TargetH2-K region expressed gene 2, rat orthologue
LigandBDBM50079837
Substrate/Competitorn/a
Meas. Tech.ChEBML_103872
IC50 340±n/a nM
Citation Jones, ABActon, JJRivetna, MNCummings, RTCubbon, RMNichols, EASchwartz, CDWicker, LSHermes, JD Tetrapeptide derived inhibitors of complexation of a class II MHC: the peptide backbone is not inviolate. Bioorg Med Chem Lett9:2109-14 (1999) H2-K region expressed gene 2, rat orthologue
Name:H2-K region expressed gene 2, rat orthologue
Type:PROTEIN
Mol. Mass.:14499.39
Organism:Rattus norvegicus
Description:ChEMBL_10342
Residue:127
BDBM50079837
NameBDBM50079837
Synonyms:(S)-2-[(R)-3-((E)-3-Cycloheptyl-allylamino)-2-oxo-pyrrolidin-1-yl]-pentanoic acid ((S)-1-carbamoyl-3-methyl-butyl)-amide | CHEMBL417576
TypeSmall organic molecule
Emp. Form.C25H44N4O3
Mol. Mass.448.6419
SMILESCCC[C@H](N1CC[C@@H](NC\C=C\C2CCCCCC2)C1=O)C(=O)N[C@@H](CC(C)C)C(N)=O