Reaction Details
TargetH2-K region expressed gene 2, rat orthologue
LigandBDBM50079835
Substrate/Competitorn/a
Meas. Tech.ChEBML_103872
IC50>50000±n/a nM
Citation Jones, ABActon, JJRivetna, MNCummings, RTCubbon, RMNichols, EASchwartz, CDWicker, LSHermes, JD Tetrapeptide derived inhibitors of complexation of a class II MHC: the peptide backbone is not inviolate. Bioorg Med Chem Lett9:2109-14 (1999) H2-K region expressed gene 2, rat orthologue
Name:H2-K region expressed gene 2, rat orthologue
Type:PROTEIN
Mol. Mass.:14499.39
Organism:Rattus norvegicus
Description:ChEMBL_10342
Residue:127
BDBM50079835
NameBDBM50079835
Synonyms:((S)-2-{(R)-1-[(S)-1-((S)-1-Carbamoyl-3-methyl-butylcarbamoyl)-butyl]-2-oxo-pyrrolidin-3-ylamino}-1-cyclohexylmethyl-ethyl)-carbamic acid ethyl ester | CHEMBL304031
TypeSmall organic molecule
Emp. Form.C27H49N5O5
Mol. Mass.523.7085
SMILESCCC[C@H](N1CC[C@@H](NC[C@H](CC2CCCCC2)NC(=O)OCC)C1=O)C(=O)N[C@@H](CC(C)C)C(N)=O