Reaction Details
TargetH2-K region expressed gene 2, rat orthologue
LigandBDBM50079833
Substrate/Competitorn/a
Meas. Tech.ChEMBL_103873 (CHEMBL712990)
IC50 760±n/a nM
Citation Jones, ABActon, JJAdams, ADYuen, WNichols, EASchwartz, CDWicker, LSHermes, JD Tetrapeptide derived inhibitors of complexation of a class II MHC: fully unnatural ligands. Bioorg Med Chem Lett9:2115-8 (1999) H2-K region expressed gene 2, rat orthologue
Name:H2-K region expressed gene 2, rat orthologue
Type:PROTEIN
Mol. Mass.:14499.39
Organism:Rattus norvegicus
Description:ChEMBL_10342
Residue:127
BDBM50079833
NameBDBM50079833
Synonyms:(S)-2-[(R)-3-(3-Cyclohexyl-propylamino)-2-oxo-pyrrolidin-1-yl]-pentanoic acid ((S)-1-carbamoyl-3-methyl-butyl)-amide | CHEMBL303099
TypeSmall organic molecule
Emp. Form.C24H44N4O3
Mol. Mass.436.6312
SMILESCCC[C@H](N1CC[C@@H](NCCCC2CCCCC2)C1=O)C(=O)N[C@@H](CC(C)C)C(N)=O