Reaction Details
TargetH2-K region expressed gene 2, rat orthologue
LigandBDBM50079847
Substrate/Competitorn/a
Meas. Tech.ChEMBL_103873 (CHEMBL712990)
IC50 1260±n/a nM
Citation Jones, ABActon, JJAdams, ADYuen, WNichols, EASchwartz, CDWicker, LSHermes, JD Tetrapeptide derived inhibitors of complexation of a class II MHC: fully unnatural ligands. Bioorg Med Chem Lett9:2115-8 (1999) H2-K region expressed gene 2, rat orthologue
Name:H2-K region expressed gene 2, rat orthologue
Type:PROTEIN
Mol. Mass.:14499.39
Organism:Rattus norvegicus
Description:ChEMBL_10342
Residue:127
BDBM50079847
NameBDBM50079847
Synonyms:1-(3-Cyclohexyl-propylamino)-cyclopentanecarboxylic acid [(S)-1-((S)-1-carbamoyl-3-methyl-butylcarbamoyl)-butyl]-amide | CHEMBL417735
TypeSmall organic molecule
Emp. Form.C26H48N4O3
Mol. Mass.464.6843
SMILESCCC[C@H](NC(=O)C1(CCCC1)NCCCC1CCCCC1)C(=O)N[C@@H](CC(C)C)C(N)=O