Reaction Details
TargetBeta-2 adrenergic receptor
LigandBDBM50027663
Substrate/Competitorn/a
Meas. Tech.ChEMBL_1895521 (CHEMBL4397556)
Ki 0.030000±n/a nM
Citation Stanek, MPicard, LPSchmidt, MFKaindl, JMHübner, HBouvier, MWeikert, DGmeiner, P Hybridization of ?-Adrenergic Agonists and Antagonists Confers G Protein Bias. J Med Chem62:5111-5131 (2019) 
 
Beta-2 adrenergic receptor
Name:Beta-2 adrenergic receptor
Type:n/a
Mol. Mass.:46461.69
Organism:Homo sapiens (Human)
Description:P07550
Residue:413
BDBM50027663
NameBDBM50027663
Synonyms:1-(9H-Carbazol-4-yloxy)-3-isopropylamino-propan-2-ol 1-(9H-carbazol-4-yloxy)-3-(isopropylamino)propan-2-ol Carazolol | corazolol
TypeSmall organic molecule
Emp. Form.C18H22N2O2
Mol. Mass.298.3795
SMILESCC(C)NCC(O)COc1cccc2[nH]c3ccccc3c12