Reaction Details
TargetBeta-2 adrenergic receptor
LigandBDBM50167072
Substrate/Competitorn/a
Meas. Tech.ChEMBL_1895521 (CHEMBL4397556)
Ki 0.030000±n/a nM
Citation Stanek, MPicard, LPSchmidt, MFKaindl, JMHübner, HBouvier, MWeikert, DGmeiner, P Hybridization of ?-Adrenergic Agonists and Antagonists Confers G Protein Bias. J Med Chem62:5111-5131 (2019) 
 
Beta-2 adrenergic receptor
Name:Beta-2 adrenergic receptor
Type:n/a
Mol. Mass.:46461.69
Organism:Homo sapiens (Human)
Description:P07550
Residue:413
BDBM50167072
NameBDBM50167072
Synonyms:CHEMBL3799125
TypeSmall organic molecule
Emp. Form.C24H26N2O4
Mol. Mass.406.4742
SMILESCOc1ccccc1OCCNC[C@H](O)COc1cccc2[nH]c3ccccc3c12