Reaction Details
Target5-hydroxytryptamine receptor 1A
LigandBDBM50079949
Substrate/Competitorn/a
Meas. Tech.ChEMBL_1167 (CHEMBL616112)
Ki 195±n/a nM
Citation Birch, AMBradley, PAGill, JCKerrigan, FNeedham, PL N-Substituted (2,3-dihydro-1,4-benzodioxin-2-yl)methylamine derivatives as D(2) antagonists/5-HT(1A) partial agonists with potential as atypical antipsychotic agents. J Med Chem42:3342-55 (1999) 
 
5-hydroxytryptamine receptor 1A
Name:5-hydroxytryptamine receptor 1A
Type:G Protein-Coupled Receptor (GPCR)
Mol. Mass.:46445.29
Organism:Rattus norvegicus (rat)
Description:Binding assays were performed using rat hippocampal membranes.
Residue:422
BDBM50079949
NameBDBM50079949
Synonyms:(2-Methyl-2,3-dihydro-benzo[1,4]dioxin-2-ylmethyl)-(1-pyrimidin-2-yl-piperidin-4-ylmethyl)-amine | CHEMBL324985
TypeSmall organic molecule
Emp. Form.C20H26N4O2
Mol. Mass.354.446
SMILESCC1(CNCC2CCN(CC2)c2ncccn2)COc2ccccc2O1