Reaction Details
TargetGlutamate receptor ionotropic, NMDA 1/2C
LigandBDBM4308
Substrate/Competitorn/a
Meas. Tech.ChEMBL_141029 (CHEMBL749383)
IC50>100000±n/a nM
Citation Tamiz, APCai, SXZhou, ZLYuen, PWSchelkun, RMWhittemore, ERWeber, EWoodward, RMKeana, JF Structure-activity relationship of N-(phenylalkyl)cinnamides as novel NR2B subtype-selective NMDA receptor antagonists. J Med Chem42:3412-20 (1999) 
 
Glutamate receptor ionotropic, NMDA 1/2C
Name:Glutamate receptor ionotropic, NMDA 1/2C
Type:n/a
Mol. Mass.:n/a
Description:ASSAY_ID of EBI is 141029
Components:This complex has 2 components.
Component 1
Name:Glutamate receptor ionotropic, NMDA 1
Synonyms:Glutamate (NMDA) receptor subunit zeta 1 Glutamate-NMDA-Channel Glutamate-NMDA-Polyamine NMDA Nmdar1 | phencyclidine
Type:Enzyme Catalytic Domain
Mol. Mass.:105533.40
Organism:RAT
Description:P35439
Residue:938
Component 2
Name:Glutamate receptor ionotropic, NMDA 2C
Synonyms:Glutamate NMDA receptor; Grin1/Grin2c Grin2c NMDE3_RAT
Type:Protein
Mol. Mass.:135305.94
Organism:Rattus norvegicus (Rat)
Description:Q00961
Residue:1237
BDBM4308
NameBDBM4308
Synonyms:(2E)-2-cyano-3-(3,4-dihydroxyphenyl)-N-(4-phenylbutyl)prop-2-enamide Tyrphostin deriv. 56
TypeSmall organic molecule
Emp. Form.C20H20N2O3
Mol. Mass.336.3844
SMILESOc1ccc(\C=C(/C#N)C(=O)NCCCCc2ccccc2)cc1O