Reaction Details
TargetEpidermal growth factor receptor
LigandBDBM4308
Substrate/Competitorn/a
Meas. Tech.ChEMBL_67055 (CHEMBL674104)
IC50 5000±n/a nM
Citation Tamiz, APCai, SXZhou, ZLYuen, PWSchelkun, RMWhittemore, ERWeber, EWoodward, RMKeana, JF Structure-activity relationship of N-(phenylalkyl)cinnamides as novel NR2B subtype-selective NMDA receptor antagonists. J Med Chem42:3412-20 (1999) 
 
Epidermal growth factor receptor
Name:Epidermal growth factor receptor
Type:Receptor Kinase Domain
Mol. Mass.:134279.59
Organism:Homo sapiens (Human)
Description:P00533
Residue:1210
BDBM4308
NameBDBM4308
Synonyms:(2E)-2-cyano-3-(3,4-dihydroxyphenyl)-N-(4-phenylbutyl)prop-2-enamide Tyrphostin deriv. 56
TypeSmall organic molecule
Emp. Form.C20H20N2O3
Mol. Mass.336.3844
SMILESOc1ccc(\C=C(/C#N)C(=O)NCCCCc2ccccc2)cc1O