Reaction Details
TargetGlutamate receptor ionotropic, NMDA 1/2B
LigandBDBM4303
Substrate/Competitorn/a
Meas. Tech.ChEMBL_141026 (CHEMBL748097)
IC50 660.0±n/a nM
Citation Tamiz, APCai, SXZhou, ZLYuen, PWSchelkun, RMWhittemore, ERWeber, EWoodward, RMKeana, JF Structure-activity relationship of N-(phenylalkyl)cinnamides as novel NR2B subtype-selective NMDA receptor antagonists. J Med Chem42:3412-20 (1999) 
 
Glutamate receptor ionotropic, NMDA 1/2B
Name:Glutamate receptor ionotropic, NMDA 1/2B
Type:n/a
Mol. Mass.:n/a
Description:ASSAY_ID of EBI is 141026
Components:This complex has 2 components.
Component 1
Name:Glutamate receptor ionotropic, NMDA 2B
Synonyms:GluN2B Grin2b NMDA receptor subunit N2B (GluN2B) NMDE2_RAT | NR2B
Type:Protein
Mol. Mass.:166077.66
Organism:Rattus norvegicus (Rat)
Description:Q00960
Residue:1482
Component 2
Name:Glutamate receptor ionotropic, NMDA 1
Synonyms:Glutamate (NMDA) receptor subunit zeta 1 Glutamate-NMDA-Channel Glutamate-NMDA-Polyamine NMDA Nmdar1 | phencyclidine
Type:Enzyme Catalytic Domain
Mol. Mass.:105533.40
Organism:RAT
Description:P35439
Residue:938
BDBM4303
NameBDBM4303
Synonyms:(2E)-2-cyano-3-(3,4-dihydroxyphenyl)-N-(3-phenylpropyl)prop-2-enamide (E)-2-cyano-3-(3,4-dihydroxyphenyl)-N-(3-phenylpropyl)acrylamide (E)-3-[3,4-bis(oxidanyl)phenyl]-2-cyano-N-(3-phenylpropyl)prop-2-enamide MLS000069704 TYRPHOSTIN AG 555 cid_5328770
TypeSmall organic molecule
Emp. Form.C19H18N2O3
Mol. Mass.322.3578
SMILESOc1ccc(\C=C(/C#N)C(=O)NCCCc2ccccc2)cc1O